FreeBSD-main-amd64-test - Build #24944 - Still Unstable

From: <>
Date: Fri, 15 Mar 2024 20:00:55 UTC
FreeBSD-main-amd64-test - Build #24944 (1b38f851d809950cfe112c705029f40edd0579b3) - Still Unstable

Build information:
Full change log:
Full build log:

Status explanation:
"Unstable" - some tests are suspected being broken by the following changes
"Still Unstable" - the failing test cases have not been fixed by these
                   following changes and this is a notification to note that
                   these changes have not been fully tested by the CI system

Change summaries:
(Those commits are likely but not certainly responsible)

5c318f5ce3e293d8479d686da25c1a4460c09388 by bapt:
pkgbase: remove packages which do not exists anymore

9eae9233fdcc946945f4191e1413f548adfa2943 by bapt:
nuageinit: be case insentive when looking got labels

a00f9e4e81810374755910ad7abf0fc335dcf86d by imp:
scsi: Stop installing both cam.4 and CAM.4

d2a824c29d6925ba8675a811aa81f2ad7d92129d by imp:
share/mk: Don't install only differing in case files on case insensitive

1b38f851d809950cfe112c705029f40edd0579b3 by jhb:
nvmecontrol: Update the test for a valid firmare revision slot

The failed test cases:

4 tests failed.

Error Message:
/usr/local/lib/python3.9/multiprocessing/ EOFError

FAILED:  sys.netpfil.common.dummynet.pf_queue

Error Message:
We failed prioritisation 1 times

FAILED:  sys.fs.tmpfs.times_test.empty

Error Message:
Test case was expecting a failure but none were raised

FAILED:  cddl.usr.sbin.zfsd.zfsd_unittest.main

Error Message:
Received signal 6