FreeBSD-main-amd64-test - Build #24928 - Still Unstable

From: <>
Date: Tue, 12 Mar 2024 05:16:17 UTC
FreeBSD-main-amd64-test - Build #24928 (462af7676b3ee8a8bd9ee9b55a35c0cf815a351f) - Still Unstable

Build information:
Full change log:
Full build log:

Status explanation:
"Unstable" - some tests are suspected being broken by the following changes
"Still Unstable" - the failing test cases have not been fixed by these
                   following changes and this is a notification to note that
                   these changes have not been fully tested by the CI system

Change summaries:
(Those commits are likely but not certainly responsible)

c112243f6bd3738ab1ca0fc56ba1accef66c9d7a by brooks:
Revert "Update to bring the rack stack with all its fixes in."

3ae18fdfbcaad827defdc217386e73c993beeba0 by imp:
kboot: Create function for error checking.

8b1925f29c54f5791db3c8dcdf2b67541bb8ab32 by imp:
kboot: Avoid UB in signed shift

d650c3efb638f1b2742429a5fb8e7c087839868b by imp:
kboot: hostfs -- check for llseek failure correctly

a9cd3b675e243648aa681bc6ce1bf3e788be88c8 by imp:
kboot: Print UEFI memory map

d75524b3fe21752b233f66ae8e9d6450d507f75c by imp:
kboot: Use is_linux_error to check mmap return error

462af7676b3ee8a8bd9ee9b55a35c0cf815a351f by imp:
kboot: kbootfdt: fix error handling

The failed test cases:

4 tests failed.

Error Message:
/usr/local/lib/python3.9/multiprocessing/ EOFError

FAILED:  sys.netpfil.common.dummynet.pf_pls_gilbert

Error Message:
atf-check failed; see the output of the test for details

FAILED:  sys.netpfil.common.dummynet.pf_queue

Error Message:
We failed prioritisation 1 times

FAILED:  cddl.usr.sbin.zfsd.zfsd_unittest.main

Error Message:
Received signal 6