FreeBSD-main-amd64-test - Build #24927 - Still Unstable

From: <>
Date: Mon, 11 Mar 2024 19:53:47 UTC
FreeBSD-main-amd64-test - Build #24927 (16f8d8829472dfdf6b3b2bb21d652f0bafefccbc) - Still Unstable

Build information:
Full change log:
Full build log:

Status explanation:
"Unstable" - some tests are suspected being broken by the following changes
"Still Unstable" - the failing test cases have not been fixed by these
                   following changes and this is a notification to note that
                   these changes have not been fully tested by the CI system

Change summaries:
(Those commits are likely but not certainly responsible)

9eb461aa4b61ab47855b2cee9e5b626a76888b5e by des:
Vendor import of diff from OpenBSD's Game of Trees

55951611e49a5a43ba151582505019c38558c0e7 by glebius:
tests/unix_seqpacket: mk_pair_of_sockets() requires a valid argument

16f8d8829472dfdf6b3b2bb21d652f0bafefccbc by glebius:
netlink: fix route protocol constant values to match Linux

The failed test cases:

3 tests failed.
FAILED:  libexec.tftpd.functional.wrq_eaccess_v6

Error Message:
Test case body timed out

FAILED:  sys.netinet6.lpm6.lpm6_test2_success

Error Message:
atf-check failed; see the output of the test for details

FAILED:  cddl.usr.sbin.zfsd.zfsd_unittest.main

Error Message:
Received signal 6