FreeBSD-main-amd64-test - Build #24677 - Still Unstable

From: <>
Date: Tue, 16 Jan 2024 09:43:59 UTC
FreeBSD-main-amd64-test - Build #24677 (393f2dca362a4f32f852e95f84bb3bb4a40ea3b5) - Still Unstable

Build information:
Full change log:
Full build log:

Status explanation:
"Unstable" - some tests are suspected being broken by the following changes
"Still Unstable" - the failing test cases have not been fixed by these
                   following changes and this is a notification to note that
                   these changes have not been fully tested by the CI system

Change summaries:
(Those commits are likely but not certainly responsible)

09a43b8790bdeb97fbecd3ea767c2f599eb4a4d3 by kevans:
kern: tty: fix ttyinq_read_uio assertion

d51dac5f1370bdca1ea20c6b48cdea463f6f5dda by kevans:
kern: tty: fix EOF handling for canonical reads

522083ffbd1ab9b485861750e889d606dc75ed0a by kevans:
kern: tty: recanonicalize the buffer on ICANON/VEOF/VEOL changes

30189156d325fbcc9d1997d791daedc9fa3bed20 by kevans:
kern: pts: do not special case closed slave side

393f2dca362a4f32f852e95f84bb3bb4a40ea3b5 by imp:
mount: Add a note that userquota and groupquota aren't printed with -p

The failed test cases:

3 tests failed.
FAILED:  sys.netinet6.proxy_ndp.pndp_neighbor_advert

Error Message:
atf-check failed; see the output of the test for details

FAILED:  sys.kern.shutdown_dgram.unblock

Error Message:
Test case body timed out

FAILED:  sys.kern.unix_passfd_dgram.send_and_shutdown

Error Message:
/usr/src/tests/sys/kern/unix_passfd_test.c:431: openfiles() == nfiles - 1 not met