FreeBSD-main-amd64-test - Build #24676 - Still Unstable

From: <>
Date: Tue, 16 Jan 2024 05:06:55 UTC
FreeBSD-main-amd64-test - Build #24676 (08efe9bef43b784b3cd4f22252a8f908f448895b) - Still Unstable

Build information:
Full change log:
Full build log:

Status explanation:
"Unstable" - some tests are suspected being broken by the following changes
"Still Unstable" - the failing test cases have not been fixed by these
                   following changes and this is a notification to note that
                   these changes have not been fully tested by the CI system

Change summaries:
(Those commits are likely but not certainly responsible)

b9e8ae1d8a424194b4e185359da4ded163f24f4e by karels:
route: error on IPv4 network routes with incorrect destination

2524b7dfb0df7e37ea9651559ce6c027b006e2a9 by markj:
crashinfo: Print stack traces for all on-CPU threads

1c909c300b92601f7690610097ac98126caff835 by asomers:
fusefs: fix an interaction between copy_file_range and mmap

daf26f9350cf8fb3ae60d4528b60ddf65a56f5cc by asomers:
fusefs: more consistent operand ordering in

11500481c82c9fa6e7d3b9a707bd9ca1ed637c2d by imp:
mptable: improve error reporting for invalid commands

57623b3b745a2a89ea9b998cadf8cc8c02228fea by imp: Soften the single line braces requirement

08efe9bef43b784b3cd4f22252a8f908f448895b by imp:
GitHub: style: Add the synchronize activity type

The failed test cases:

2 tests failed.
FAILED:  sys.kern.shutdown_dgram.unblock

Error Message:
Test case body timed out

FAILED:  sys.kern.unix_passfd_dgram.send_and_shutdown

Error Message:
/usr/src/tests/sys/kern/unix_passfd_test.c:431: openfiles() == nfiles - 1 not met