FreeBSD-main-amd64-test - Build #25150 - Still Unstable

From: <>
Date: Tue, 23 Apr 2024 21:44:33 UTC
FreeBSD-main-amd64-test - Build #25150 (f48643d376a45529094d39db25a471a19ab40870) - Still Unstable

Build information:
Full change log:
Full build log:

Status explanation:
"Unstable" - some tests are suspected being broken by the following changes
"Still Unstable" - the failing test cases have not been fixed by these
                   following changes and this is a notification to note that
                   these changes have not been fully tested by the CI system

Change summaries:
(Those commits are likely but not certainly responsible)

96a2e036b7095e819cc536b6145950b54dffb929 by mhorne:
Update manual page references and macros to align to mandoc syntax

c5989febcc00be41e05b4b714bbfc6ea1359abaf by mhorne:
ieee80211_vap(9): fix the title

fcdf9a19893b9b5beb7a21407de507f0ae4c500b by emaste:
Support ARP for 802 networks

53e0938b0b5619fa851e8550c2396bd8c440b7ae by kib:
kern_thread.c: remove unneeded include of sys/param.h

2effad53b4676dcfe4da892cd72a9a235a9539d1 by kib:
kern_thr.c/kern_sig.c: remove sys/cdefs.h

0c11c1792b139baffbf74e5f1c6fe065708301cc by kib:
kern_thr.c: normalize includes

53186bc1435e2c3ccf9c2124c066a08c6a80c504 by kib:
sigqueue(2): add impl-specific flag __SIGQUEUE_TID

dcc180c51b9c13df3d1158d14d450308711fe93c by kib:
sigqueue(2): Document __SIGQUEUE_TID

97acb35bd704ac1ef0bd2e286eb8bd09ce4b3ef0 by kib:
sys/signal.h: move union sigval into dedicated private header

220aa0f450409948b869237e5c4505f992c913ce by kib:
libthr: add pthread_sigqueue(3)

91da6becae6291533b9b59646b59bace2f905c81 by kib:
pthread_sigqueue(3): document

fb2ab7ce52d3f1e9d0998f3e5c12c3468ce4563a by kib:
Add test for pthread_sigqueue(3)

6d5ce2bb63445e9c09c3b5c29fb18983e1e2628c by markj:
nfsserver: Default to nfs_reserved_port_only="YES"

ca0620b70750d4b5b03a7f03393acbe9600870c1 by markj:
RELNOTES: Add an entry for the nfs_reserved_port_only default change

f48643d376a45529094d39db25a471a19ab40870 by dim:
Use MOVED_LIBS for usr/lib/ entry

The failed test cases:

3 tests failed.
FAILED:  usr.bin.unzip.functional_test.test_I

Error Message:
atf-check failed; see the output of the test for details

FAILED:  sys.kern.unix_seqpacket_test.random_eor_and_waitall

Error Message:
/usr/src/tests/sys/kern/unix_seqpacket_test.c:1182: send(params->sock, &params->sendbuf[off], len, flags) == len not met

FAILED:  sys.netinet6.divert.ipdivert_ip6_output_remote_success

Error Message:
1 != 0 (1 != 0)