FreeBSD-main-amd64-test - Build #25127 - Still Unstable

From: <>
Date: Wed, 17 Apr 2024 22:33:50 UTC
FreeBSD-main-amd64-test - Build #25127 (f122045e36dd009ecdc6b69a6f4b751c4b10b443) - Still Unstable

Build information:
Full change log:
Full build log:

Status explanation:
"Unstable" - some tests are suspected being broken by the following changes
"Still Unstable" - the failing test cases have not been fixed by these
                   following changes and this is a notification to note that
                   these changes have not been fully tested by the CI system

Change summaries:
(Those commits are likely but not certainly responsible)

75eda0096bf83b9b88996d9903b5d4e504047eba by imp:
networking.7 : create network quickstart guide

1b7487592987c91020063a311a14dc15b6e58075 by dim:
heimdal: Add 64-bit integer support to ASN.1 compiler

219b6e442308d5353b2af5f0771ce9b887b70754 by dim:
heimdal: asn1: Use unsigned bitfields for named bitsets

f122045e36dd009ecdc6b69a6f4b751c4b10b443 by imp:
crunchgen: add --list option

The failed test cases:

4 tests failed.
FAILED:  sys.netpfil.common.dummynet.pf_queue

Error Message:
We failed prioritisation 1 times

FAILED:  usr.bin.unzip.functional_test.test_I

Error Message:
atf-check failed; see the output of the test for details

FAILED:  sys.kern.unix_seqpacket_test.random_eor_and_waitall

Error Message:
/usr/src/tests/sys/kern/unix_seqpacket_test.c:1182: send(params->sock, &params->sendbuf[off], len, flags) == len not met

FAILED:  sys.netinet6.divert.ipdivert_ip6_output_remote_success

Error Message:
1 != 0 (1 != 0)