FreeBSD-main-amd64-test - Build #25126 - Still Unstable

From: <>
Date: Wed, 17 Apr 2024 17:35:39 UTC
FreeBSD-main-amd64-test - Build #25126 (b7e4666d7b69c22699a9299687018a892a5dad5b) - Still Unstable

Build information:
Full change log:
Full build log:

Status explanation:
"Unstable" - some tests are suspected being broken by the following changes
"Still Unstable" - the failing test cases have not been fixed by these
                   following changes and this is a notification to note that
                   these changes have not been fully tested by the CI system

Change summaries:
(Those commits are likely but not certainly responsible)

b6a4776008519bb4a1d5abfe63c46d5f009ce102 by bapt:
nuageinit: start the script after zfs

b7e4666d7b69c22699a9299687018a892a5dad5b by markj:
nfsserver: Rate-limit messages about requests from unprivileged ports

The failed test cases:

3 tests failed.
FAILED:  usr.bin.unzip.functional_test.test_I

Error Message:
atf-check failed; see the output of the test for details

FAILED:  sys.kern.unix_seqpacket_test.random_eor_and_waitall

Error Message:
/usr/src/tests/sys/kern/unix_seqpacket_test.c:1182: send(params->sock, &params->sendbuf[off], len, flags) == len not met

FAILED:  sys.netinet6.divert.ipdivert_ip6_output_remote_success

Error Message:
1 != 0 (1 != 0)