FreeBSD-main-amd64-test - Build #25092 - Still Unstable

From: <>
Date: Fri, 12 Apr 2024 20:25:52 UTC
FreeBSD-main-amd64-test - Build #25092 (4336161cc9c631d40d00adee97dfc8161b6bec9f) - Still Unstable

Build information:
Full change log:
Full build log:

Status explanation:
"Unstable" - some tests are suspected being broken by the following changes
"Still Unstable" - the failing test cases have not been fixed by these
                   following changes and this is a notification to note that
                   these changes have not been fully tested by the CI system

Change summaries:
(Those commits are likely but not certainly responsible)

122dd78c143e3d138b5d503a30da4c326f41002a by imp:
sys/netipsec: fix IPSEC_SUPPORT for non-INET kernels

0478a0356272ab3907af9d97711f0bb8b14bf38b by imp:
sys/dev/irdma/irdma_cm: fix compile without INET

042fb58d009e7efc5b334b68fffbef9b1f620ec8 by imp:
sys/netinet6/in6_pcb.c: fix compile without INET

cc0af6d5a6c2b10b8655945abdd4ab110cb11998 by imp:
intro.1: 2024 edition

53b5393319dd7b54d63e8bf9aa82e48618552ecb by khng:
uart_snps: Register a device xref for UARTs

cb722b67796ddc700c73919183e80049c3ec17f3 by khng:
ibcore: Remove the use of NULL_IB_OBJECT

bfd2ce2a5a61f16f2f8c98f4fbdcf47a758275ce by stevek:
efidev: Allow for optionally including efidev and efirtc into the kernel

e5035d08578e372d40b4e2d4c3574b7583549bd6 by des:
install: Always use a temporary file.

17dc7017d7375b3463d65adffe1eb980b0f86795 by des:
install: Simplify path construction.

4336161cc9c631d40d00adee97dfc8161b6bec9f by des:
install: Don't skip syncing in the common case.

The failed test cases:

5 tests failed.
FAILED:  sys.netinet6.ndp.ndp_del_gu_success

Error Message:
atf-check failed; see the output of the test for details

FAILED:  sys.kern.unix_passfd_stream.empty_rights_message

Error Message:
/usr/src/tests/sys/kern/unix_passfd_test.c:906: len == -1 && errno == EINVAL not met

FAILED:  sys.kern.unix_seqpacket_test.random_eor_and_waitall

Error Message:
/usr/src/tests/sys/kern/unix_seqpacket_test.c:1182: send(params->sock, &params->sendbuf[off], len, flags) == len not met

FAILED:  sys.netinet6.divert.ipdivert_ip6_output_remote_success

Error Message:
1 != 0 (1 != 0)

FAILED:  cddl.usr.sbin.zfsd.zfsd_unittest.main

Error Message:
Received signal 6