FreeBSD-main-amd64-test - Build #25091 - Still Unstable

From: <>
Date: Fri, 12 Apr 2024 18:55:32 UTC
FreeBSD-main-amd64-test - Build #25091 (737799dfd3a87cbbe1ff091c13a90c98e3ee21d3) - Still Unstable

Build information:
Full change log:
Full build log:

Status explanation:
"Unstable" - some tests are suspected being broken by the following changes
"Still Unstable" - the failing test cases have not been fixed by these
                   following changes and this is a notification to note that
                   these changes have not been fully tested by the CI system

Change summaries:
(Those commits are likely but not certainly responsible)

d8925a5f42b517131f926d665538be95db710c4a by andrew:
Support BTI in rtld

737799dfd3a87cbbe1ff091c13a90c98e3ee21d3 by markm:
Now that D44168 has been merged to stable/14, update the manpage

The failed test cases:

4 tests failed.
FAILED:  sys.kern.unix_passfd_stream.empty_rights_message

Error Message:
/usr/src/tests/sys/kern/unix_passfd_test.c:906: len == -1 && errno == EINVAL not met

FAILED:  sys.kern.unix_seqpacket_test.random_eor_and_waitall

Error Message:
/usr/src/tests/sys/kern/unix_seqpacket_test.c:1182: send(params->sock, &params->sendbuf[off], len, flags) == len not met

FAILED:  sys.netinet6.divert.ipdivert_ip6_output_remote_success

Error Message:
1 != 0 (1 != 0)

FAILED:  cddl.usr.sbin.zfsd.zfsd_unittest.main

Error Message:
Received signal 6