FreeBSD-main-amd64-test - Build #24178 - Still Unstable

From: <>
Date: Wed, 27 Sep 2023 20:26:45 UTC
FreeBSD-main-amd64-test - Build #24178 (c362fe939f6fe52056fb7506be9e5cbd0a5ef60b) - Still Unstable

Build information:
Full change log:
Full build log:

Status explanation:
"Unstable" - some tests are suspected being broken by the following changes
"Still Unstable" - the failing test cases have not been fixed by these
                   following changes and this is a notification to note that
                   these changes have not been fully tested by the CI system

Change summaries:
(Those commits are likely but not certainly responsible)

16c0a3151e5fa4958711f64bbc2f172cfe781743 by bapt:
nvi: import version 2.2.1

1f31e00e19f9e24d4c891a24973e08a027c4f71c by bapt:
flua: add fbsd module

1e3214571b78a659ccf8174e1528546d5c385a20 by asomers:
printenv: fix typo in a comment

b5a2bf512dbe5bc8535e28e9f584a08444965426 by markj:
makefs/zfs: Use unsigned integers for indirect block level counts

46402fd21631b7d4686f8c341d92db6bcb190e5d by markj:
makefs/zfs: Set the objset block pointer fill field correctly

87534f95dd2ed51e01165e0072cb1c7790809a8b by markj:
makefs/zfs tests: Run zdb prior to importing makefs-created pools

2f0b059eeafc545a4ab1835d6a5290e1e2ebb47f by emaste:
intrng: switch from MAXCPU to mp_ncpus

f549e22901b3a391c76659bee55802b1214112fd by zlei:
ip_mroute: Fix sysctl knobs

da695970cee95d0b460c451d5ff9c2cea04f1b73 by emaste:
UPDATING: add a note about EARLY_AP_STARTUP on x86

c362fe939f6fe52056fb7506be9e5cbd0a5ef60b by mhorne:
pmcstat: fix duplicate event allocation on CPU 0

The failed test cases:

3 tests failed.
FAILED:  sys.netinet6.frag6.frag6_19.frag6_19

Error Message:
Global IPv6 statistics do not match: 19 != 20

FAILED:  usr.bin.file.file_test.contrib_file_tests

Error Message:
atf-check failed; see the output of the test for details

FAILED:  sys.fs.tmpfs.times_test.empty

Error Message:
Incorrect atime