FreeBSD-main-amd64-test - Build #24177 - Still Unstable

From: <>
Date: Wed, 27 Sep 2023 16:06:30 UTC
FreeBSD-main-amd64-test - Build #24177 (81f36fbc98dd74ca923938e0329919d426811b0c) - Still Unstable

Build information:
Full change log:
Full build log:

Status explanation:
"Unstable" - some tests are suspected being broken by the following changes
"Still Unstable" - the failing test cases have not been fixed by these
                   following changes and this is a notification to note that
                   these changes have not been fully tested by the CI system

Change summaries:
(Those commits are likely but not certainly responsible)

015daf5221f7588b9258fe0242cee09bde39fe21 by markj:
hdac: Defer interrupt allocation in hdac_attach()

61a14ddfe012ca7b57a101725e5c654269f200ca by markj:
unix: Fix a lock order reveral

f97a3f6a017103b2afaf451af055ec4131a455a9 by markj: Fix the latest entry's date

a3074ff2122faf0eaba7d3f989e916b1c7f21912 by markj:
socket tests: Avoid a buffer leak

81f36fbc98dd74ca923938e0329919d426811b0c by markj:
glabel.8: Warn against using generic labels on a shared device

The failed test cases:

6 tests failed.

Error Message:
atf-check failed; see the output of the test for details


Error Message:
/usr/tests/atf_python/sys/net/ IndexError

FAILED:  sys.fs.fusefs.mknod.main

Error Message:
Returned non-success exit status 1

FAILED:  sys.netinet6.frag6.frag6_19.frag6_19

Error Message:
Global IPv6 statistics do not match: 19 != 20

FAILED:  usr.bin.file.file_test.contrib_file_tests

Error Message:
atf-check failed; see the output of the test for details

FAILED:  sys.fs.tmpfs.times_test.empty

Error Message:
Incorrect atime