FreeBSD-main-amd64-test - Build #24238 - Still Unstable

From: <>
Date: Tue, 10 Oct 2023 17:46:33 UTC
FreeBSD-main-amd64-test - Build #24238 (52fe961c6caef7c45d130c9a85ca341fcde1f7ff) - Still Unstable

Build information:
Full change log:
Full build log:

Status explanation:
"Unstable" - some tests are suspected being broken by the following changes
"Still Unstable" - the failing test cases have not been fixed by these
                   following changes and this is a notification to note that
                   these changes have not been fully tested by the CI system

Change summaries:
(Those commits are likely but not certainly responsible)

b627b3e6ea0d806b2c54dd1654cab310825ae147 by bapt:
RELNOTES: fix typo

8733bc277a383cf59f38a83956f4f523869cfc90 by mjg:
vfs: don't provoke recycling non-free vnodes without a good reason

52fe961c6caef7c45d130c9a85ca341fcde1f7ff by bapt:
src.conf(5): regen after 38981026e70390c

The failed test cases:

5 tests failed.
FAILED:  bin.pkill.pkill-j_test.main

Error Message:
1 of 4 tests failed

FAILED:  sys.kern.ptrace_test.ptrace__follow_fork_both_attached_unrelated_debugger

Error Message:
/usr/src/tests/sys/kern/ptrace_test.c:592: WIFSTOPPED(status) not met

FAILED:  sys.netinet6.proxy_ndp.pndp_neighbor_advert

Error Message:
atf-check failed; see the output of the test for details

FAILED:  sys.netinet6.frag6.frag6_19.frag6_19

Error Message:
Global IPv6 statistics do not match: 19 != 20

FAILED:  sys.fs.tmpfs.times_test.empty

Error Message:
Incorrect atime