FreeBSD-main-amd64-test - Build #24237 - Still Unstable

From: <>
Date: Tue, 10 Oct 2023 12:48:01 UTC
FreeBSD-main-amd64-test - Build #24237 (d09a64e15d8fad6588b9aad62979f20afa8441df) - Still Unstable

Build information:
Full change log:
Full build log:

Status explanation:
"Unstable" - some tests are suspected being broken by the following changes
"Still Unstable" - the failing test cases have not been fixed by these
                   following changes and this is a notification to note that
                   these changes have not been fully tested by the CI system

Change summaries:
(Those commits are likely but not certainly responsible)

6d3c0798ccbe7f6d3b677eed31206efc1227be50 by bapt:
bsdconfig: rework packages selection TUI

ff01d71e48d40399c873113020ae8db158a01f94 by bapt:
bsdconfig: do not remove files id MK_DIALOG=no

38981026e70390ccfb99930ec6d71299dd2af780 by bapt:
dialog(1): switch off dialog(1) by default

bb63e82e8c109156b31e806fac8ecefbd259a0ed by bapt:
bsddialog(1): document the replacement of dialog(1)

03f5bd1e462576838e79145379ce314e2e03e4b3 by dchagin:
linux(4): Drop the outdated comment, nosys is fine since 39024a89

5bdd74cc05e6c7d110688feacdbd22b6dffe5d72 by dchagin:
linux(4): Drop the outdated comments about sixth register on i386

2cef62886dc7c33ca01f70ca712845da1e55b470 by kp:
pf: convert state retrieval to netlink

f218b851da0480460195c1128d0c0b41d3b6a6d4 by kp:
libpfctl: introduce state iterator

a7191e5d7b625c35434f99f51ccbf577228b2afc by kp:
pf: add a way to list creator ids

84d12f887c91fc2e2859edfeb0673fe7f953bd87 by kp:
Add a COMPAT_FREEBSD14 kernel option

ebfd3b229af1cf0036ebaedbb09d9721ec037c0f by kp:

e340882d3e49a98aa39b13041a2bf714c30dccdf by andrew:
arm64: Add BTI landing pads to assembly functions

d09a64e15d8fad6588b9aad62979f20afa8441df by andrew:
arm64: Enable kernel branch protection

The failed test cases:

3 tests failed.
FAILED:  sys.netpfil.common.dummynet.pf_queue

Error Message:
We failed prioritisation 1 times

FAILED:  sys.netinet6.frag6.frag6_19.frag6_19

Error Message:
Global IPv6 statistics do not match: 19 != 20

FAILED:  sys.fs.tmpfs.times_test.empty

Error Message:
Incorrect atime