FreeBSD-main-amd64-test - Build #24194 - Still Unstable

From: <>
Date: Mon, 02 Oct 2023 17:22:02 UTC
FreeBSD-main-amd64-test - Build #24194 (db195a523f9bbeb111b621d2c2c7a46d8b921631) - Still Unstable

Build information:
Full change log:
Full build log:

Status explanation:
"Unstable" - some tests are suspected being broken by the following changes
"Still Unstable" - the failing test cases have not been fixed by these
                   following changes and this is a notification to note that
                   these changes have not been fully tested by the CI system

Change summaries:
(Those commits are likely but not certainly responsible)

e61568aeeec7667789e6c9d4837e074edecc990e by markj:
swap_pager: Fix a race in swap_pager_swapoff_object()

d94d07d58141dcff48f01c6b3e5a31de9d7a7938 by markj:
netdump: Check the return value of ifunit_ref()

773606fcdfae00a3f850bcd39969a63d9a8fb129 by mhorne:
ofwdump: install dependent on MK_FDT

4ed35b7d1eb5dddfd04f574ac122651d532d2df9 by bz:
net80211: improve ddb output for sta and rate

db195a523f9bbeb111b621d2c2c7a46d8b921631 by bz:
net80211: make ieee80211_alloc_node() private

The failed test cases:

3 tests failed.
FAILED:  sys.netinet6.frag6.frag6_19.frag6_19

Error Message:
Global IPv6 statistics do not match: 19 != 20

FAILED:  usr.bin.file.file_test.contrib_file_tests

Error Message:
atf-check failed; see the output of the test for details

FAILED:  sys.fs.tmpfs.times_test.empty

Error Message:
Incorrect atime