FreeBSD-main-amd64-test - Build #24193 - Still unstable

From: <>
Date: Mon, 02 Oct 2023 06:14:07 UTC
FreeBSD-main-amd64-test - Build #24193 (4cf8075264c9db8f3e39a1f17def58cda8803853) - Still unstable

Build information:
Full change log:
Full build log:

Status explanation:
"Unstable" - some tests are suspected being broken by the following changes
"Still Unstable" - the failing test cases have not been fixed by these
                   following changes and this is a notification to note that
                   these changes have not been fully tested by the CI system

Change summaries:
(Those commits are likely but not certainly responsible)

4cf8075264c9db8f3e39a1f17def58cda8803853 by pkubaj: only leave ofwdump.8.gz when WITH_FDT is set

The failed test cases:

3 tests failed.
FAILED:  sys.netinet6.frag6.frag6_19.frag6_19

Error Message:
Global IPv6 statistics do not match: 19 != 20

FAILED:  usr.bin.file.file_test.contrib_file_tests

Error Message:
atf-check failed; see the output of the test for details

FAILED:  sys.fs.tmpfs.times_test.empty

Error Message:
Incorrect atime