FreeBSD-main-amd64-test - Build #24451 - Still Unstable

From: <>
Date: Tue, 28 Nov 2023 06:56:09 UTC
FreeBSD-main-amd64-test - Build #24451 (a5c27819344bfcbdf5ae6a430af9c6ca98b0a249) - Still Unstable

Build information:
Full change log:
Full build log:

Status explanation:
"Unstable" - some tests are suspected being broken by the following changes
"Still Unstable" - the failing test cases have not been fixed by these
                   following changes and this is a notification to note that
                   these changes have not been fully tested by the CI system

Change summaries:
(Those commits are likely but not certainly responsible)

6a79e48076bcce3e902323e62689eacb98faa180 by rrs:
Fix two latent bugs in hpts. One where a static is put on

47a0b59379c3bec547e7c829eb12de8276227dff by kp:
pfctl: use libpfctl instead of DIOCGETRULES directly

2905d10b392766faf0e0ce8070864132d8ab66c3 by kp:
snmp_pf: use libpfctl's pfctl_get_rules_info() rather than DIOCGETRULES

44f323ecdec02dc947c34d08c34b881fe2da1ba6 by kp:
pf: implement DIOCGETRULES via netlink

0187875a6c0b68a8026be174f8a0f968fc8ab6ed by kp:
pfctl: Fix recursive printing of anchor labels

1d723c1e565e714e4192883d813ef81e97220f27 by kp:
pf tests: test recursive printing of labels

96950419f15510287080c557174e0d8409f06956 by glebius:
tests: don't run atf_* in a subshell

97bd53ef4d20b7d15e0b0976e885af9438f5637e by cperciva:
Makefile.vm: Fix duplicate rc.conf files

8b923102f957e72c686d41075ce040f61e64fe6f by imp:
Revert "cdefs: Remove __func__ define"

a5c27819344bfcbdf5ae6a430af9c6ca98b0a249 by imp:
cdefs: Remove __func__ stub.

The failed test cases:

3 tests failed.
FAILED:  bin.pwait.pwait_test.timeout_no_timeout

Error Message:
atf-check failed; see the output of the test for details

FAILED:  sys.audit.administrative.auditctl_success

Error Message:
Test case cleanup timed out

FAILED:  sys.kqueue.proc3_test.proc3

Error Message:
/usr/src/contrib/netbsd-tests/kernel/kqueue/t_proc3.c:89: ke.fflags & NOTE_CHILD not met