FreeBSD-main-amd64-test - Build #24450 - Still Unstable

From: <>
Date: Mon, 27 Nov 2023 20:16:02 UTC
FreeBSD-main-amd64-test - Build #24450 (1a7c9e1585dd3ae14b03226e359d434c10066bfb) - Still Unstable

Build information:
Full change log:
Full build log:

Status explanation:
"Unstable" - some tests are suspected being broken by the following changes
"Still Unstable" - the failing test cases have not been fixed by these
                   following changes and this is a notification to note that
                   these changes have not been fully tested by the CI system

Change summaries:
(Those commits are likely but not certainly responsible)

789ffce392946d2f71a51bbac60db16dcdea2928 by wulf:
ig4: Add PCI IDs for Intel Ice Lake I2C controller.

ae477ca7da55f76d28859e1bd01cd1051e36f28f by brooks:
bzip2: remove locally added __FBSDID

3f944f3bb75fe6eae6000511ad19799d90da54ba by brooks:
ee: remove locally added __FBSDID

78e6a1bd063884ae2c42256bcaee6824efbcfbc8 by brooks:
pnpinfo: remove locally added __FBSDID

a159b74a5d86e89eb86dcb5df3ec402e662012a6 by brooks:
smbfs: remove locally added __FBSDID

a3c858005cae175e277f6f6735ca9eaea7eaf3c3 by brooks:
telnet: remove locally added __FBSDID

3faba3002f466e1bdad4767c55257e04433ee96b by brooks:
x86emu: remove localy added __FBSDID

1a7c9e1585dd3ae14b03226e359d434c10066bfb by karels:
pwait.1: add missing prompt and command in examples

The failed test cases:

3 tests failed.
FAILED:  bin.pwait.pwait_test.or_flag

Error Message:
atf-check failed; see the output of the test for details

FAILED:  sys.audit.administrative.auditctl_success

Error Message:
Test case cleanup timed out

FAILED:  sys.kqueue.proc3_test.proc3

Error Message:
/usr/src/contrib/netbsd-tests/kernel/kqueue/t_proc3.c:89: ke.fflags & NOTE_CHILD not met