FreeBSD-main-amd64-test - Build #23644 - Still Unstable

From: <>
Date: Wed, 31 May 2023 03:51:53 UTC
FreeBSD-main-amd64-test - Build #23644 (dc103686348d3205733a2c77e7d2ccbff6691022) - Still Unstable

Build information:
Full change log:
Full build log:

Status explanation:
"Unstable" - some tests are suspected being broken by the following changes
"Still Unstable" - the failing test cases have not been fixed by these
                   following changes and this is a notification to note that
                   these changes have not been fully tested by the CI system

Change summaries:
(Those commits are likely but not certainly responsible)

8e63e787abbd69d29e55e2e0b2aa0aa624339f3b by jrtc27:
pmc: Initialise and check the pm_flags field for CONFIGURELOG

53d0b9e438bc30ef12c24fddec13e97ade852164 by jrtc27:
pmc: Provide full path to modules from kernel linker

659a0041dd06355704f1bce0c5d7cbcb0b32c0a4 by jrtc27:
imgact: Make et_dyn_addr part of image_params

94426d21bf62f2b36dc9b556ab27c401a412a026 by jrtc27:
pmc: Rework PROCEXEC event to support PIEs

d6f00fa046bb9e0c81d5168ed4a92867c5b96f7a by jrtc27:
pmc: Bump major version for just-committed breaking changes

dc103686348d3205733a2c77e7d2ccbff6691022 by emaste:
unbound: avoid calling deprecated OpenSSL function

The failed test cases:

4 tests failed.
FAILED:  sys.kqueue.libkqueue.kqueue_test.main

Error Message:
Returned non-success exit status 1


Error Message:
atf-check failed; see the output of the test for details


Error Message:
/usr/tests/sys/netlink/ AssertionError


Error Message:
/usr/tests/sys/netlink/ AssertionError