FreeBSD-main-amd64-test - Build #23643 - Still Unstable

From: <>
Date: Wed, 31 May 2023 00:54:24 UTC
FreeBSD-main-amd64-test - Build #23643 (2071e54c226a120a62baa710bef225c4f6ad5ee3) - Still Unstable

Build information:
Full change log:
Full build log:

Status explanation:
"Unstable" - some tests are suspected being broken by the following changes
"Still Unstable" - the failing test cases have not been fixed by these
                   following changes and this is a notification to note that
                   these changes have not been fully tested by the CI system

Change summaries:
(Those commits are likely but not certainly responsible)

4e78addbeff902aabaa87fdaafbd962f90720d69 by markj:
buf: Make the number of pbufs slightly more dynamic

a306ed50ecd57f060a549c14bc53a60b34aaa6bb by markj:
inpcb: Restore missing validation of local addresses for jailed sockets

2071e54c226a120a62baa710bef225c4f6ad5ee3 by grahamperrin:
hier(7): alphabetical order

The failed test cases:

3 tests failed.
FAILED:  sys.fs.fusefs.symlink.main

Error Message:
Returned non-success exit status 1


Error Message:
/usr/tests/sys/netlink/ AssertionError


Error Message:
/usr/tests/sys/netlink/ AssertionError