FreeBSD-main-amd64-test - Build #23628 - Still Unstable

From: <>
Date: Sun, 28 May 2023 21:24:15 UTC
FreeBSD-main-amd64-test - Build #23628 (697727110b68e483c320d834bcbcdf01c01142a1) - Still Unstable

Build information:
Full change log:
Full build log:

Status explanation:
"Unstable" - some tests are suspected being broken by the following changes
"Still Unstable" - the failing test cases have not been fixed by these
                   following changes and this is a notification to note that
                   these changes have not been fully tested by the CI system

Change summaries:
(Those commits are likely but not certainly responsible)

e15da6b10a4971f43aa604fca3ea43effa096f4c by kevans:
libc: locale: fix collation file size validation

697727110b68e483c320d834bcbcdf01c01142a1 by rmacklem:
gssd: Improve failure message when running in a jail

The failed test cases:

4 tests failed.
FAILED:  sys.fs.fusefs.symlink.main

Error Message:
Returned non-success exit status 1

FAILED:  sys.kern.ptrace_test.ptrace__follow_fork_both_attached_unrelated_debugger

Error Message:
/usr/src/tests/sys/kern/ptrace_test.c:594: WIFSTOPPED(status) not met


Error Message:
/usr/tests/sys/netlink/ AssertionError


Error Message:
/usr/tests/sys/netlink/ AssertionError