FreeBSD-main-amd64-test - Build #23627 - Still Unstable

From: <>
Date: Sun, 28 May 2023 19:18:22 UTC
FreeBSD-main-amd64-test - Build #23627 (402cee1f19b613bae844a176156a41cdfa507585) - Still Unstable

Build information:
Full change log:
Full build log:

Status explanation:
"Unstable" - some tests are suspected being broken by the following changes
"Still Unstable" - the failing test cases have not been fixed by these
                   following changes and this is a notification to note that
                   these changes have not been fully tested by the CI system

Change summaries:
(Those commits are likely but not certainly responsible)

92b2b066353ddd32e1d59f8c52c430d552d9a9a5 by cy:
sqlite3: Vendor import of sqlite3 3.42.0

The failed test cases:

3 tests failed.
FAILED:  sys.kern.ptrace_test.ptrace__follow_fork_child_detached_unrelated_debugger

Error Message:
/usr/src/tests/sys/kern/ptrace_test.c:594: WIFSTOPPED(status) not met


Error Message:
/usr/tests/sys/netlink/ AssertionError


Error Message:
/usr/tests/sys/netlink/ AssertionError