FreeBSD-main-amd64-test - Build #23462 - Still Unstable

From: <>
Date: Tue, 02 May 2023 01:20:41 UTC
FreeBSD-main-amd64-test - Build #23462 (a5b4ec5281929a9b7ef4a8005bb4b0035322e922) - Still Unstable

Build information:
Full change log:
Full build log:

Status explanation:
"Unstable" - some tests are suspected being broken by the following changes
"Still Unstable" - the failing test cases have not been fixed by these
                   following changes and this is a notification to note that
                   these changes have not been fully tested by the CI system

Change summaries:
(Those commits are likely but not certainly responsible)

ed2e50508ce4f3473cf8afc9b395813149486196 by emaste:
bxe: prefer C99 bool to boolean_t

5f2e84015da7a664bba0af7727349c9c3f6902ba by emaste: decouple lib*_pic.a from TOOLCHAIN build knob

91ac713b646de667ac149be7dfe06adba4ce55cc by imp:
stand/boot1.efi: Allow modules to add env variables

439a9766adbabcdfcce9fb0396b43c9e1482155a by imp:
stand/zfs: Move spa_find_by_dev from zfsimpl.c to zfs.c

6479bd1b7d347e42012fab64b595b0cf091e13f4 by imp:
stand/zfs: Refactor zfs_get_bootenv

4dcae288fe63667bdf930258b94e0e51a2d05787 by imp:
stand/zfs: Refactor zfs_set_bootenv

b765cfa380a47de2b77cbf8a6249e226b0de2275 by imp:
stand/zfs: Refactor zfs_get_bootonce

43f7eeff0d45769e1deaf0a6879bc807fdafaf4c by imp:
stand/boot1.efi: Implement bootonce for ZFS

0c4183f02efccbb09892f3e5c97745884afe189d by imp:
rc.d/zfsbe: Simplify

5ce98ee5f42de10d29f3a99719652c272d13c2e7 by imp:
stand/userboot: Simplify code

d5babd0d23769d365a83bebc0a5cd8cbfb55564d by imp:
stand/efi: Simplify code here

5328f9034fc410b105629700a1309bebf094266a by imp:
stand/kboot: Simplify

cb8179079ab08263b0e3835655a83a8915f33eb4 by imp:
stand: Fix warning about variable unused

96b119340eec331bdbbbdea606dae64cd2dce774 by imp:
stand: remove ZFS warning about computered but unused variable

6c8358cd7ffd71acec74036429a8afb502720722 by imp:
stand: back out the most of the horrible aarch64 kludge

b53ec4e44f6f66f2235a96f7c0508a586b1275f1 by imp:
stand: Add isspace to FreeBSD ctypes.h

83eabc64efec4aaf46f87bf2ba5560ecd4c336d7 by imp:
kboot: Add HOST_MAP_FAILED define

cf6044857e2b20f2ecf90929027e9dd335b38803 by imp:
stand: Testing program for smbios

facd0edbb26cec53e8b958f426b7f46550db6c5f by imp:
kboot: Fix an off by one error

a083d086763594a7072b11fd9ef0553c6466da34 by imp:
kboot: Add smbios support

c5e433b99ed3ddef0eb4fa937f38c34d4a3c4ae0 by imp:
stand: Avoid unaligned access in smbios code

a5b4ec5281929a9b7ef4a8005bb4b0035322e922 by imp:
stand: More protection against malformed smbios tables

The failed test cases:

3 tests failed.

Error Message:
/usr/local/lib/python3.9/multiprocessing/ EOFError

FAILED:  sys.file.path_test.path_pipe_fstatat

Error Message:
/usr/src/tests/sys/file/path_test.c:851: fstatat pipe: Not a directory

FAILED:  sys.netlink.test_snl.snl_parse_errmsg_capped

Error Message:
1 checks failed; see output for more details