FreeBSD-main-amd64-test - Build #23461 - Still Unstable

From: <>
Date: Mon, 01 May 2023 22:39:43 UTC
FreeBSD-main-amd64-test - Build #23461 (2a3bd0870869819354b5ea65761d13e5e2987697) - Still Unstable

Build information:
Full change log:
Full build log:

Status explanation:
"Unstable" - some tests are suspected being broken by the following changes
"Still Unstable" - the failing test cases have not been fixed by these
                   following changes and this is a notification to note that
                   these changes have not been fully tested by the CI system

Change summaries:
(Those commits are likely but not certainly responsible)

75baf3765c686547e8e4a5510858f45c23ccdec3 by emaste:
Cirrus-CI: set PKG_FORMAT via top level `env:`

2a3bd0870869819354b5ea65761d13e5e2987697 by emaste:
pkgbase: hide duplicate METALOG directory warnings under verbose

The failed test cases:

3 tests failed.
FAILED:  sys.fs.fusefs.mknod.main

Error Message:
Returned non-success exit status 1

FAILED:  sys.file.path_test.path_pipe_fstatat

Error Message:
/usr/src/tests/sys/file/path_test.c:851: fstatat pipe: Not a directory

FAILED:  sys.netlink.test_snl.snl_parse_errmsg_capped

Error Message:
1 checks failed; see output for more details