FreeBSD-main-amd64-test - Build #23721 - Still Unstable

From: <>
Date: Tue, 13 Jun 2023 10:21:28 UTC
FreeBSD-main-amd64-test - Build #23721 (f1549d7d522995bf5d821ae08cc2f500ba545285) - Still Unstable

Build information:
Full change log:
Full build log:

Status explanation:
"Unstable" - some tests are suspected being broken by the following changes
"Still Unstable" - the failing test cases have not been fixed by these
                   following changes and this is a notification to note that
                   these changes have not been fully tested by the CI system

Change summaries:
(Those commits are likely but not certainly responsible)

0eb0d2333546cc2af4027e43a5a254a0e2790dce by melifaro:
ktest: make ktest work with Netlink loaded as a module.

ab4d1b73cbf8980dbe05cde7d822010042db8344 by melifaro:
route(8): teach route to attach to jails

74b426116181bdef5cc57760345d8270471b4aa8 by melifaro:
ifconfig: add if_ctx argument to the generic and ifclone callbacks.

c6885dbda7399139f6401438e0e7aa366df4773d by melifaro:
ifconfig: eliminate global 'verbose' and 'printkey' variables

4106282ec41d92b98c29e25316d11d93600a8f23 by melifaro:
ifconfig: remove global 'printifname' variable.

c6f0602f2349d64bc7a3fdfd6a2ead388e6226d6 by melifaro:
ifconfig: pass if_ctx instead of socket to the tunnel handlers.

85e0016a9730b6540d729bfe41ddc33eaedfee69 by melifaro:
ifconfig: remove global 'name' variable.

ea73ff9752f77b3ed0d20f3d958fda8b51b0cf23 by melifaro:
ifconfig: remove global_args variable.

d77ca41f7762bc909a83d87ebd95735b4021652f by melifaro:
ifconfig(8): add the dotted format for MAC addresses.

f1549d7d522995bf5d821ae08cc2f500ba545285 by mckusick:
Write out corrected superblock when creating a UFS/FFS snapshot.

The failed test cases:

4 tests failed.

Error Message:
atf-check failed; see the output of the test for details

FAILED:  sys.netinet6.frag6.frag6_19.frag6_19

Error Message:
Global IPv6 statistics do not match: 19 != 20


Error Message:
/usr/tests/sys/netlink/ AssertionError


Error Message:
/usr/tests/sys/netlink/ AssertionError