FreeBSD-main-amd64-test - Build #23720 - Still Unstable

From: <>
Date: Tue, 13 Jun 2023 07:50:35 UTC
FreeBSD-main-amd64-test - Build #23720 (08300d849485bd6231d3a18cb430cab4279edef3) - Still Unstable

Build information:
Full change log:
Full build log:

Status explanation:
"Unstable" - some tests are suspected being broken by the following changes
"Still Unstable" - the failing test cases have not been fixed by these
                   following changes and this is a notification to note that
                   these changes have not been fully tested by the CI system

Change summaries:
(Those commits are likely but not certainly responsible)

08300d849485bd6231d3a18cb430cab4279edef3 by delphij:
expand_number: Tighten check of unit.

The failed test cases:

3 tests failed.
FAILED:  sys.netinet6.frag6.frag6_19.frag6_19

Error Message:
Global IPv6 statistics do not match: 19 != 20


Error Message:
/usr/tests/sys/netlink/ AssertionError


Error Message:
/usr/tests/sys/netlink/ AssertionError