FreeBSD-main-amd64-test - Build #23702 - Still Unstable

From: <>
Date: Fri, 09 Jun 2023 15:03:57 UTC
FreeBSD-main-amd64-test - Build #23702 (a75d93a74d55d371876f5444075de4ecd685297f) - Still Unstable

Build information:
Full change log:
Full build log:

Status explanation:
"Unstable" - some tests are suspected being broken by the following changes
"Still Unstable" - the failing test cases have not been fixed by these
                   following changes and this is a notification to note that
                   these changes have not been fully tested by the CI system

Change summaries:
(Those commits are likely but not certainly responsible)

e9a38ed2fa61fd264a80f24ceb35f39b0ac6463d by kib:
rtld: fix allocate_module_tls() variant I fallback to static allocation

a75d93a74d55d371876f5444075de4ecd685297f by jrm:
tcpdump: Do not hard code HAVE_LIBCRYPTO in config.h

The failed test cases:

3 tests failed.
FAILED:  sys.netinet6.frag6.frag6_19.frag6_19

Error Message:
Global IPv6 statistics do not match: 19 != 20


Error Message:
/usr/tests/sys/netlink/ AssertionError


Error Message:
/usr/tests/sys/netlink/ AssertionError