FreeBSD-main-amd64-test - Build #23701 - Still Unstable

From: <>
Date: Fri, 09 Jun 2023 06:18:11 UTC
FreeBSD-main-amd64-test - Build #23701 (5253d74e4650300815af351cc510a1c392a16584) - Still Unstable

Build information:
Full change log:
Full build log:

Status explanation:
"Unstable" - some tests are suspected being broken by the following changes
"Still Unstable" - the failing test cases have not been fixed by these
                   following changes and this is a notification to note that
                   these changes have not been fully tested by the CI system

Change summaries:
(Those commits are likely but not certainly responsible)

5253d74e4650300815af351cc510a1c392a16584 by kbowling:
e1000: Format em_txrx

The failed test cases:

4 tests failed.
FAILED:  sys.netinet6.frag6.frag6_19.frag6_19

Error Message:
Global IPv6 statistics do not match: 19 != 20


Error Message:
atf-check failed; see the output of the test for details


Error Message:
/usr/tests/sys/netlink/ AssertionError


Error Message:
/usr/tests/sys/netlink/ AssertionError