FreeBSD-main-amd64-test - Build #23698 - Still Unstable

From: <>
Date: Thu, 08 Jun 2023 22:28:20 UTC
FreeBSD-main-amd64-test - Build #23698 (1320520ba488386251a7d02bd90842e031931133) - Still Unstable

Build information:
Full change log:
Full build log:

Status explanation:
"Unstable" - some tests are suspected being broken by the following changes
"Still Unstable" - the failing test cases have not been fixed by these
                   following changes and this is a notification to note that
                   these changes have not been fully tested by the CI system

Change summaries:
(Those commits are likely but not certainly responsible)

51a183021fce3928d24b11c319d2787f5a15ae87 by jrm:
Import tcpdump 4.99.4

732786a25fd7e9b48b1d64f51c41c80129e37563 by andrew:
arm64: Reduce the direct use of cpu_desc

d057b7aac8aedd353f2cb047cb0069f6a4db7a83 by andrew:
arm64: Malloc the cpu_desc array

f40cd16bfda4f4512033bb9e7212ee5d8b94b9a7 by emaste:
kern: Move devctl_systems[] out of sys/sys/devctl.h

b889315da3009256c5078e629a28763d981b70ad by bz:
LinuxKPI: add ktime_get_real_ts64()

7c0c69d1a0f3735e315a48436bffbd482f956270 by bz:
LinuxKPI: add struct_group(...)

7d7d12ba7765902f51dabb259a186ca3b1a2d351 by bz:

17bde9cbc6fc3ac219aa11243c0b75025786f628 by bz:
LinuxKPI: pci: update struct msi_desc

4cbd427788ec625f17c1ecdfccbb7b06c1c908d9 by bz:
LinuxKPI: add devm_ioremap()

a30a0d940daef2df51371cf142790109e2019fa0 by bz:
LinuxKPI: add dummy rhashtable implementation

469727c966bbd91447c8402470452b95810f3ffe by jrtc27:
Makefile.inc1: Use INSTALL_DDIR for distributeworld's distrib-dirs

2e0d99a953ef30ad29b3c0143c0aa7a815cf8ef1 by jrtc27:
Makefile.inc1: Fix distributeworld mtree mangling for dist root dir

dfa1982352ee312079b42ea49adcbc1da15722f7 by jrtc27:
etc: Don't create stray directories in NO_ROOT distrib-dirs

e3e2681d0ec28d6661fef6da76c9479049e2761c by glebius:
stand/loader.efi: read zfs bootonce attribute before checking currdev

bbc64cf66cdf03bc0e45aecfbca13f7b6f025a65 by glebius:
stand/boot1.efi: use the bootonce dataset as root dataset

1320520ba488386251a7d02bd90842e031931133 by markj:
libvmmapi: Remove some unneeded includes

The failed test cases:

3 tests failed.
FAILED:  sys.netinet6.frag6.frag6_19.frag6_19

Error Message:
Global IPv6 statistics do not match: 19 != 20


Error Message:
/usr/tests/sys/netlink/ AssertionError


Error Message:
/usr/tests/sys/netlink/ AssertionError