FreeBSD-main-amd64-test - Build #23697 - Still Unstable

From: <>
Date: Thu, 08 Jun 2023 18:48:55 UTC
FreeBSD-main-amd64-test - Build #23697 (b17b639832e707aab0e9514cf94727498e2d67bd) - Still Unstable

Build information:
Full change log:
Full build log:

Status explanation:
"Unstable" - some tests are suspected being broken by the following changes
"Still Unstable" - the failing test cases have not been fixed by these
                   following changes and this is a notification to note that
                   these changes have not been fully tested by the CI system

Change summaries:
(Those commits are likely but not certainly responsible)

533de2d7a9875ff652be477a3f6c817d66a3d3d9 by emaste:
Vendor import of Spleen font 2.0.0

The failed test cases:

5 tests failed.
FAILED:  sys.kern.ptrace_test.ptrace__follow_fork_both_attached_unrelated_debugger

Error Message:
/usr/src/tests/sys/kern/ptrace_test.c:594: WIFSTOPPED(status) not met


Error Message:
atf-check failed; see the output of the test for details

FAILED:  sys.netinet6.frag6.frag6_19.frag6_19

Error Message:
Global IPv6 statistics do not match: 19 != 20


Error Message:
/usr/tests/sys/netlink/ AssertionError


Error Message:
/usr/tests/sys/netlink/ AssertionError