FreeBSD-main-amd64-test - Build #23670 - Still Unstable

From: <>
Date: Sun, 04 Jun 2023 11:31:40 UTC
FreeBSD-main-amd64-test - Build #23670 (c8dbef44ffbe8d8acf33a5f20e20ca6b48beb4fa) - Still Unstable

Build information:
Full change log:
Full build log:

Status explanation:
"Unstable" - some tests are suspected being broken by the following changes
"Still Unstable" - the failing test cases have not been fixed by these
                   following changes and this is a notification to note that
                   these changes have not been fully tested by the CI system

Change summaries:
(Those commits are likely but not certainly responsible)

0be13a45f7cb18f8b86c800a28457bf918e130f2 by dchagin:
xregs_sig: Add a ability to handle multiple register banks

c8dbef44ffbe8d8acf33a5f20e20ca6b48beb4fa by dchagin:
xregs_sig: Add avx registers to test

The failed test cases:

3 tests failed.
FAILED:  sys.netinet6.frag6.frag6_19.frag6_19

Error Message:
Global IPv6 statistics do not match: 19 != 20


Error Message:
/usr/tests/sys/netlink/ AssertionError


Error Message:
/usr/tests/sys/netlink/ AssertionError