FreeBSD-main-amd64-test - Build #23669 - Still Unstable

From: <>
Date: Sun, 04 Jun 2023 06:42:33 UTC
FreeBSD-main-amd64-test - Build #23669 (086e0149ae56641af245ce472e787c2f67d3aea5) - Still Unstable

Build information:
Full change log:
Full build log:

Status explanation:
"Unstable" - some tests are suspected being broken by the following changes
"Still Unstable" - the failing test cases have not been fixed by these
                   following changes and this is a notification to note that
                   these changes have not been fully tested by the CI system

Change summaries:
(Those commits are likely but not certainly responsible)

086e0149ae56641af245ce472e787c2f67d3aea5 by jamie:
jail: Use re-entrant versions of lex & yacc, and lex's yylineno

The failed test cases:

4 tests failed.

Error Message:
atf-check failed; see the output of the test for details

FAILED:  sys.netinet6.frag6.frag6_19.frag6_19

Error Message:
Global IPv6 statistics do not match: 19 != 20


Error Message:
/usr/tests/sys/netlink/ AssertionError


Error Message:
/usr/tests/sys/netlink/ AssertionError