FreeBSD-main-amd64-test - Build #23667 - Still Unstable

From: <>
Date: Sat, 03 Jun 2023 23:55:47 UTC
FreeBSD-main-amd64-test - Build #23667 (fa6fa98ac712e48fe8e9bca1295b1c54cf744724) - Still Unstable

Build information:
Full change log:
Full build log:

Status explanation:
"Unstable" - some tests are suspected being broken by the following changes
"Still Unstable" - the failing test cases have not been fixed by these
                   following changes and this is a notification to note that
                   these changes have not been fully tested by the CI system

Change summaries:
(Those commits are likely but not certainly responsible)

d434607b3d5182d38b82f23fe0586b3744dd0273 by christos:
kinst: use bool where appropriate

47a5d58e3bba71094e5476295df96484bc633365 by christos:
kinst: fix kinst_probe_md field indentation

fa6fa98ac712e48fe8e9bca1295b1c54cf744724 by bapt:
sh(1): initialize smark to zero in main()

The failed test cases:

3 tests failed.
FAILED:  sys.netinet6.frag6.frag6_19.frag6_19

Error Message:
Global IPv6 statistics do not match: 19 != 20


Error Message:
/usr/tests/sys/netlink/ AssertionError


Error Message:
/usr/tests/sys/netlink/ AssertionError