FreeBSD-main-amd64-test - Build #23666 - Still Unstable

From: <>
Date: Sat, 03 Jun 2023 21:04:50 UTC
FreeBSD-main-amd64-test - Build #23666 (e5b3cd6100e4ecaba0a21f58c2fd6ca0cb0dc8df) - Still Unstable

Build information:
Full change log:
Full build log:

Status explanation:
"Unstable" - some tests are suspected being broken by the following changes
"Still Unstable" - the failing test cases have not been fixed by these
                   following changes and this is a notification to note that
                   these changes have not been fully tested by the CI system

Change summaries:
(Those commits are likely but not certainly responsible)

8fdc9ce97c00b1d6d92bb5e426c9906b30149b43 by dchagin:
avx_sig: Better naming as the test will include more register banks

1b0d96f3c43a5f997dca120a83a4b06995df345b by dchagin:
xregs_sig: Finish renaming simd to xregs before adding avx

e5b3cd6100e4ecaba0a21f58c2fd6ca0cb0dc8df by dchagin:
xregs_sig: Simplify Makefile by using MACHINE_CPUARCH in SRCS

The failed test cases:

6 tests failed.
FAILED:  sys.kern.ptrace_test.ptrace__follow_fork_both_attached_unrelated_debugger

Error Message:
/usr/src/tests/sys/kern/ptrace_test.c:594: WIFSTOPPED(status) not met


Error Message:
atf-check failed; see the output of the test for details

FAILED:  sys.netpfil.common.dummynet.pf_queue

Error Message:
We failed prioritisation 1 times

FAILED:  sys.netinet6.frag6.frag6_19.frag6_19

Error Message:
Global IPv6 statistics do not match: 19 != 20


Error Message:
/usr/tests/sys/netlink/ AssertionError


Error Message:
/usr/tests/sys/netlink/ AssertionError