FreeBSD-main-amd64-test - Build #23657 - Still Unstable

From: <>
Date: Fri, 02 Jun 2023 06:45:38 UTC
FreeBSD-main-amd64-test - Build #23657 (409594ef340b71252a0dc1fedbdb36977642e20a) - Still Unstable

Build information:
Full change log:
Full build log:

Status explanation:
"Unstable" - some tests are suspected being broken by the following changes
"Still Unstable" - the failing test cases have not been fixed by these
                   following changes and this is a notification to note that
                   these changes have not been fully tested by the CI system

Change summaries:
(Those commits are likely but not certainly responsible)

79d4d7133f07b399155a4d2eb20a8ee1ca705569 by emaste:
dumpon: update OpenSSL initialization call

0939cf32c0c180ac0e1974959da6962d16b96c7a by imp:
ipf/libipf: Fix typos

0dc159ced7183e969a3b0be9f3f4411e5768e32a by imp:
bhyve: Fix typos

66ebda7a04f9c401327fbb2b344d430377963659 by imp:
bluetooth: Fix typos

8c9946be5265a7d5913e4467a3ce9fc47fe24c5b by imp:
bsnmpd/modules/snmp_bridge: Fix typos

de8b490010adf3f0b55783ce65812ce748f86259 by imp:
bsnmpd/modules/snmp_hostres: Fix typos

b8b97d31bda194cfcdb9c03a1b53d27dfbd884f0 by imp:
pmcstat: Fix typos

8b223768d19d2b0f0d544daf81553c2cb7293f10 by imp:
bsnmpd/tools/libbsnmptools: Fix typos

34181db8bcbf5f509b5b5de4811b38cfa79ac273 by imp:
cxgbetool: Fix typos

136a9bb4e348d4dd1edf6e3d1e092bfa074fac3e by imp:
hastd: Fix typos

05d85d77812429b83839c71b83c540fc422ae1ba by imp:
lpr: Fix typos

e095cbab2f819362576f6bcb7521665583df66a8 by imp:
ipf/ipfstat: Fix typos

589fe499b72b6d84be366b6bff66291612226079 by imp:
nvmecontrol: Fix typos

d15f57a29d78915c9218cac7692b595e5e8b4581 by imp:
camcontrol: Fix typos

b66b2c4d9b3ffff93719373396dc245b7f1ea159 by imp:
ifconfig: Fix typos

843fe4892e3c22edb22bc1b8ac9c1a44b0016671 by imp:
ipf: Fix typos

1f0cd2d9ce73ec914040615841a4fc2cb5a02897 by imp:
wlandebug: Fix typos

6372f2c8a884b20e65cdea598b055e93ce5a1147 by imp:
rpc.lockd: Fix typos

8883fd2c4b86621d9af7b4c7937737c5c7812f85 by imp:
bsnmpd/modules/snmp_lm75: Fix typos

b03b271bb73b2ee7f77db7833b041dbed9074a0f by imp:
cdcontrol: Fix typos

e71b32940258b40eb52e5cbeadb209336d62c319 by imp:
route6d: Fix typos

e4861dc8579998967779a7455d3bc8035b094e42 by imp:
ipfw/ipfw2: Fix typos

c77cc8462a114705ace269628ff27b93148093ba by imp:
mountd: Fix typos

e5263025de1aa6ec3eac24eb5e95a032dc906526 by imp:
fsck_ffs: Fix typos

a9e160c38fe1e5585184927a19bfeadef6cced55 by imp:
cron/lib: Fix typos

663b1be814c5e11f0a514a5fc02aef94bc54ded8 by imp:
efidp: Fix typos

1e95a9a41c21fee3197bf3676e1f3a0c5075d82f by imp:
mld6query: Fix typos

b152ff4c1e74b3a3d8a78392a0653953778a7dd0 by imp:
makefs: Fix typos

56ca9ef092064abd5925a76a5e59d9fdaa5b107f by imp:
mfiutil: Fix typos

fe4fa932692819317daa3fad04692b1533be5bf7 by imp:
fstyp: Fix typos

a57ca37dd1848cd42844d9082c4a74c2ed57f68a by imp:
iovctl: Fix typos

f6a119cf8d23d53093d3c094708fb3352fdd43a5 by imp:
zfsd: Fix typo in comment

ed96987b4cfaa4137e172ea8615fef127518662a by imp:
mfiuitl: Spell acquire correctly

d0b0bc37a3a5655c4979fbed206cfb6a30210ac0 by imp:
ports(7): '*-list' targets: Add/fix doc on whether they are recursive

3e1af044c9b33109b48bcca1c8c27bbe91836d37 by imp:
cam(3): Add a manual page cross reference

2675b8bd3d940e75fc5bfb550c46af5fca262072 by imp:
camcontrol(8): Add manual page cross references

2bcbf4d8314654b91f7d688194b047f7151aa955 by imp:
camcontrol(8): Use simpler language

d275d2e3d375ae3c60fde1d7b1fc2f4b1c3fb4ef by imp:
gpart(8): Refer to a related manual page

409594ef340b71252a0dc1fedbdb36977642e20a by imp:
gpart(8): Improve manual page syntax

The failed test cases:

6 tests failed.
FAILED:  sys.netinet6.frag6.frag6_19.frag6_19

Error Message:
Global IPv6 statistics do not match: 19 != 20

FAILED:  sys.netpfil.common.dummynet.pf_interface_removal

Error Message:
atf-check failed; see the output of the test for details

FAILED:  sys.netpfil.common.dummynet.pf_pipe

Error Message:
atf-check failed; see the output of the test for details

FAILED:  sys.netpfil.common.dummynet.pf_pipe_v6

Error Message:
atf-check failed; see the output of the test for details


Error Message:
/usr/tests/sys/netlink/ AssertionError


Error Message:
/usr/tests/sys/netlink/ AssertionError