FreeBSD-main-amd64-test - Build #23656 - Still Unstable

From: <>
Date: Fri, 02 Jun 2023 02:28:35 UTC
FreeBSD-main-amd64-test - Build #23656 (4d780613774c28a1efe4dc6272ae5fbc09d999f4) - Still Unstable

Build information:
Full change log:
Full build log:

Status explanation:
"Unstable" - some tests are suspected being broken by the following changes
"Still Unstable" - the failing test cases have not been fixed by these
                   following changes and this is a notification to note that
                   these changes have not been fully tested by the CI system

Change summaries:
(Those commits are likely but not certainly responsible)

fe590ffe40f49fe09d8275fbf29f0d46c5b99dc7 by vangyzen:
Import vixie cron 4.0

88ea962879be7f989b263ad6d6686d72d888253a by rmacklem:
rpc.tls[serv|clnt]d.c: Clean up code for OpenSSL3

c21438cd14d3fafc77f2cc2d591c6fad962c37ea by rmacklem:
nfsuserd.8: Substitute server for slave terminology

fe06db1817e0af6cbfa963598e249810773c115c by bapt:
bsdinstall: remove sendmail hardening option

afbb26b58b93bddf0e8720698cd712eac7f8c13d by bapt:
devctl: allow to register a hook to receive the events

8a2af0b469b6d65ee48f2352ca56225b36d32342 by bapt:
nlsysevent: add a genetlink(4) module to report kernel events

04eeb364d439bec0931f7e73627f59a88bb474f3 by bapt:
cpuset(3): Move cpuset's parselist function into libutil

c8a383396888d897d057088d7f84fb57de40807e by markj:
ktrace: Make sys/ktrace.h self-contained

0d3f1b4f25150c3c5afaa669715421821323ead1 by markj:
signal: Make the signal disposition table const

3080f82b8b644809d8731c4f5c72f1530c400eb3 by markj:
ktrace: Make the data lengths table const

18282c4772fb68a0e076d17f30de9749190542f4 by markj:
sysarch: Add includes required for ktrcapfail() calls to be compiled

aee3ee66a1820749e6babac841e08e86937cd47d by vangyzen:
cron: fix build without LOGIN_CAP

8093646b0be9731f24eddbcee7dc34e1fd2365b5 by bapt:
cpuset(3): Add unit tests

4d780613774c28a1efe4dc6272ae5fbc09d999f4 by cy:
ntp: Update version string

The failed test cases:

7 tests failed.
FAILED:  sys.fs.fusefs.symlink.main

Error Message:
Returned non-success exit status 1

FAILED:  sys.netinet6.frag6.frag6_19.frag6_19

Error Message:
Global IPv6 statistics do not match: 19 != 20

FAILED:  sys.netpfil.common.dummynet.pf_interface_removal

Error Message:
atf-check failed; see the output of the test for details

FAILED:  sys.netpfil.common.dummynet.pf_pipe

Error Message:
atf-check failed; see the output of the test for details

FAILED:  sys.netpfil.common.dummynet.pf_pipe_v6

Error Message:
atf-check failed; see the output of the test for details


Error Message:
/usr/tests/sys/netlink/ AssertionError


Error Message:
/usr/tests/sys/netlink/ AssertionError