FreeBSD-main-amd64-test - Build #22890 - Still Unstable

From: <>
Date: Mon, 30 Jan 2023 21:19:05 UTC
FreeBSD-main-amd64-test - Build #22890 (c8abb673a57587fdf9de2d5bd4d3d1f54dfedc19) - Still Unstable

Build information:
Full change log:
Full build log:

Status explanation:
"Unstable" - some tests are suspected being broken by the following changes
"Still Unstable" - the failing test cases have not been fixed by these
                   following changes and this is a notification to note that
                   these changes have not been fully tested by the CI system

Change summaries:
(Those commits are likely but not certainly responsible)

2058f075b4afc543b8735599bea7278e37b2e9f9 by dchagin:
cpuset: Handle CPU_WHICH_TIDPID wherever cpuset_which() is called.

9a93b6cf3dd97ca7bcb938f87afeb523d023f807 by jhb:
zfs: Disable -Wunused-variable for environ in main in zfs_main.c.

df949e762c67b4b4109dd16b0179f17faa925cd2 by imp:
kern_environment: Partially apply style(9)

c7c53e3ca6312c99a0e179e51357a1933de95b5a by imp:
Clarify hardpps() parameter name and comment

92b7d1db9291f11fa56e2c88f70149f319e31622 by markj:
bridge: Fix whitespace

c8abb673a57587fdf9de2d5bd4d3d1f54dfedc19 by markj:
man(1): Support zstd compressed manpages using zstdcat

The failed test cases:

3 tests failed.
FAILED:  sys.aio.aio_test.aio_socket_blocking_short_write

Error Message:
Test case body timed out

FAILED:  sys.aio.aio_test.aio_socket_blocking_short_write_vectored

Error Message:
Test case body timed out

FAILED:  sys.aio.aio_test.aio_socket_short_write_cancel

Error Message:
/usr/src/tests/sys/aio/aio_test.c:1396: aio_error(&iocb) == EINPROGRESS not met