FreeBSD-main-amd64-test - Build #22889 - Still Unstable

From: <>
Date: Mon, 30 Jan 2023 19:07:22 UTC
FreeBSD-main-amd64-test - Build #22889 (bf2dc42d0b57b32a8d576b5504926a9f7a7c3628) - Still Unstable

Build information:
Full change log:
Full build log:

Status explanation:
"Unstable" - some tests are suspected being broken by the following changes
"Still Unstable" - the failing test cases have not been fixed by these
                   following changes and this is a notification to note that
                   these changes have not been fully tested by the CI system

Change summaries:
(Those commits are likely but not certainly responsible)

bf2dc42d0b57b32a8d576b5504926a9f7a7c3628 by imp:
UPDATING: Add missing blank line between entries

The failed test cases:

4 tests failed.
FAILED:  sys.kqueue.libkqueue.kqueue_test.main

Error Message:
Returned non-success exit status 1

FAILED:  sys.aio.aio_test.aio_socket_blocking_short_write

Error Message:
Test case body timed out

FAILED:  sys.aio.aio_test.aio_socket_blocking_short_write_vectored

Error Message:
Test case body timed out

FAILED:  sys.aio.aio_test.aio_socket_short_write_cancel

Error Message:
/usr/src/tests/sys/aio/aio_test.c:1396: aio_error(&iocb) == EINPROGRESS not met