FreeBSD-main-amd64-test - Build #22867 - Still Unstable

From: <>
Date: Fri, 27 Jan 2023 13:39:53 UTC
FreeBSD-main-amd64-test - Build #22867 (cc9b2b58e2c5fa3a1a21e741155daf1609e53773) - Still Unstable

Build information:
Full change log:
Full build log:

Status explanation:
"Unstable" - some tests are suspected being broken by the following changes
"Still Unstable" - the failing test cases have not been fixed by these
                   following changes and this is a notification to note that
                   these changes have not been fully tested by the CI system

Change summaries:
(Those commits are likely but not certainly responsible)

f0435696920bd18d46a31c69105d8cbaa7d479e5 by manu:
rc.d: Put devd script in FreeBSD-devd package

d8799160c2db46ea0caa3752838808c3126e2a6c by manu:
rc.d: Put devmatch script in FreeBSD-devmatch

81b18bea0935c33fc6aafb084ca72fd427d8364a by manu:
rc.d: Put dhclient script in FreeBSD-dhclient

91314ca2ff9c5efb3dcfc20ee1976c8fdc0c1de4 by manu:
rc.d: Put ggated script in FreeBSD-ggate

36a7fa1e16a0b4446f2cb618fc84a6bc1a2cbf86 by manu:
rc.d: Put growfs script in FreeBSD-ufs

a6a21bbedc744bae9ce7b20948b53a6d4033adcf by manu:
rc.d: Put resolv script in FreeBSD-resolvconf

cc9b2b58e2c5fa3a1a21e741155daf1609e53773 by manu:
Revert "rc.d: Put growfs script in FreeBSD-ufs"

The failed test cases:

4 tests failed.
FAILED:  usr.sbin.etcupdate.preworld_test.main

Error Message:
Returned non-success exit status 1

FAILED:  sys.aio.aio_test.aio_socket_blocking_short_write

Error Message:
Test case body timed out

FAILED:  sys.aio.aio_test.aio_socket_blocking_short_write_vectored

Error Message:
Test case body timed out

FAILED:  sys.aio.aio_test.aio_socket_short_write_cancel

Error Message:
/usr/src/tests/sys/aio/aio_test.c:1396: aio_error(&iocb) == EINPROGRESS not met