FreeBSD-main-amd64-test - Build #22866 - Still unstable

From: <>
Date: Fri, 27 Jan 2023 05:45:02 UTC
FreeBSD-main-amd64-test - Build #22866 (ac4c695ad61e81d00cff2a03202a4afe94a92513) - Still unstable

Build information:
Full change log:
Full build log:

Status explanation:
"Unstable" - some tests are suspected being broken by the following changes
"Still Unstable" - the failing test cases have not been fixed by these
                   following changes and this is a notification to note that
                   these changes have not been fully tested by the CI system

Change summaries:
(Those commits are likely but not certainly responsible)

e5dc40935f6e57c6d1034ae4dea021e677bbae18 by jhb:
Revert "stdlib.h: Fix qsort_r compatibility with GCC 12."

9d2f9798175586bdcd3423443804fbbc0cffb8d2 by jhb:
<sys/cdefs.h>: Decay expression passed to fallback version of

ac4c695ad61e81d00cff2a03202a4afe94a92513 by emaste:
Retire WITHOUT_CXX option

The failed test cases:

5 tests failed.

Error Message:
/usr/local/lib/python3.9/multiprocessing/ EOFError

FAILED:  usr.sbin.etcupdate.preworld_test.main

Error Message:
Returned non-success exit status 1

FAILED:  sys.aio.aio_test.aio_socket_blocking_short_write

Error Message:
Test case body timed out

FAILED:  sys.aio.aio_test.aio_socket_blocking_short_write_vectored

Error Message:
Test case body timed out

FAILED:  sys.aio.aio_test.aio_socket_short_write_cancel

Error Message:
/usr/src/tests/sys/aio/aio_test.c:1396: aio_error(&iocb) == EINPROGRESS not met