FreeBSD-main-amd64-test - Build #22859 - Still Unstable

From: <>
Date: Wed, 25 Jan 2023 19:49:26 UTC
FreeBSD-main-amd64-test - Build #22859 (7a4a520064cb7fbff79560113682d6fe1a1ae9ee) - Still Unstable

Build information:
Full change log:
Full build log:

Status explanation:
"Unstable" - some tests are suspected being broken by the following changes
"Still Unstable" - the failing test cases have not been fixed by these
                   following changes and this is a notification to note that
                   these changes have not been fully tested by the CI system

Change summaries:
(Those commits are likely but not certainly responsible)

eaf5ec88c2df8efe49ce819c81aae582935c2e4c by imp:
stand: Add testing for i386 as well to

4410e857965edef0e3be42ae323356ec08d2aaad by imp:
stand/uboot: Remove -fPIC here

783c318fd1181d46554c31a5039db10e7f5eef49 by des:
zoneinfo: On amd64, include 32-bit data.

20ea7f26e41375828a390fba613b86acfe366add by melifaro:
pytest: delete interfaces from inside the jail.

a7b1b73935f21a3dcd6fc8d86a37b92f0c9ba93f by des:
tzcode: Document zic's -D option.

6fc1bbbf62bda2f1b5be3a4be3d36bc964490ebe by des:
w: Unlike err(3), xo_err(3) won't accept a null format string.

f1021d27f73efb821213a973e1ab9366278c78f1 by des:
zoneinfo: Always produce fat zoneinfo files.

7a4a520064cb7fbff79560113682d6fe1a1ae9ee by des:
Fix cross-build from STABLE or older CURRENT.

The failed test cases:

5 tests failed.
FAILED:  sys.netpfil.common.dummynet.pf_queue

Error Message:
We failed prioritisation 1 times

FAILED:  usr.sbin.etcupdate.preworld_test.main

Error Message:
Returned non-success exit status 1

FAILED:  sys.aio.aio_test.aio_socket_blocking_short_write

Error Message:
Test case body timed out

FAILED:  sys.aio.aio_test.aio_socket_blocking_short_write_vectored

Error Message:
Test case body timed out

FAILED:  sys.aio.aio_test.aio_socket_short_write_cancel

Error Message:
/usr/src/tests/sys/aio/aio_test.c:1396: aio_error(&iocb) == EINPROGRESS not met