FreeBSD-main-amd64-test - Build #22822 - Still Unstable

From: <>
Date: Wed, 18 Jan 2023 15:08:19 UTC
FreeBSD-main-amd64-test - Build #22822 (8580e334b0757c8d55e51b8dc7fc4051521beedf) - Still Unstable

Build information:
Full change log:
Full build log:

Status explanation:
"Unstable" - some tests are suspected being broken by the following changes
"Still Unstable" - the failing test cases have not been fixed by these
                   following changes and this is a notification to note that
                   these changes have not been fully tested by the CI system

Change summaries:
(Those commits are likely but not certainly responsible)

73c3e8b1dee6cd42de32287ea8a57762b961d8ee by corvink:
umodem: add quirk to ignore CDC_CM descriptor

8580e334b0757c8d55e51b8dc7fc4051521beedf by corvink:
umodem: ignore CDC_CM descriptor for baltech smartcard reader

The failed test cases:

6 tests failed.
FAILED:  lib.libc.time.mktime_test.timegm_epoch

Error Message:
/usr/src/contrib/netbsd-tests/lib/libc/time/t_mktime.c:98: Expected errno 0, got 84, in t == (time_t)0


Error Message:
atf-check failed; see the output of the test for details

FAILED:  usr.sbin.etcupdate.preworld_test.main

Error Message:
Returned non-success exit status 1

FAILED:  sys.aio.aio_test.aio_socket_blocking_short_write

Error Message:
Test case body timed out

FAILED:  sys.aio.aio_test.aio_socket_blocking_short_write_vectored

Error Message:
Test case body timed out

FAILED:  sys.aio.aio_test.aio_socket_short_write_cancel

Error Message:
/usr/src/tests/sys/aio/aio_test.c:1396: aio_error(&iocb) == EINPROGRESS not met