FreeBSD-main-amd64-test - Build #22821 - Still Unstable

From: <>
Date: Wed, 18 Jan 2023 12:33:37 UTC
FreeBSD-main-amd64-test - Build #22821 (896f556205c8d87ef842dc844752daa7d2385336) - Still Unstable

Build information:
Full change log:
Full build log:

Status explanation:
"Unstable" - some tests are suspected being broken by the following changes
"Still Unstable" - the failing test cases have not been fixed by these
                   following changes and this is a notification to note that
                   these changes have not been fully tested by the CI system

Change summaries:
(Those commits are likely but not certainly responsible)

95dd6974b591ce76bf8d29adcc0dd01b4b281ffd by andrew:
Always read the VFP regs in the arm64 fill_fpregs

61f5462fde6c38c1f4f5c34a05fab506b6869375 by andrew:
Always store the arm64 VFP context

a85cf421d1bfec7e753bfee781355785b00d89d4 by andrew:
Reduce an arm64 VFP critical section

896f556205c8d87ef842dc844752daa7d2385336 by andrew:
Add the fixed memory type to the pci ecam driver

The failed test cases:

7 tests failed.
FAILED:  sys.kern.ptrace_test.ptrace__follow_fork_parent_detached_unrelated_debugger

Error Message:
/usr/src/tests/sys/kern/ptrace_test.c:594: WIFSTOPPED(status) not met

FAILED:  lib.libc.time.mktime_test.timegm_epoch

Error Message:
/usr/src/contrib/netbsd-tests/lib/libc/time/t_mktime.c:98: Expected errno 0, got 84, in t == (time_t)0


Error Message:
atf-check failed; see the output of the test for details

FAILED:  usr.sbin.etcupdate.preworld_test.main

Error Message:
Returned non-success exit status 1

FAILED:  sys.aio.aio_test.aio_socket_blocking_short_write

Error Message:
Test case body timed out

FAILED:  sys.aio.aio_test.aio_socket_blocking_short_write_vectored

Error Message:
Test case body timed out

FAILED:  sys.aio.aio_test.aio_socket_short_write_cancel

Error Message:
/usr/src/tests/sys/aio/aio_test.c:1396: aio_error(&iocb) == EINPROGRESS not met