FreeBSD-main-amd64-test - Build #22809 - Still Unstable

From: <>
Date: Tue, 17 Jan 2023 13:15:03 UTC
FreeBSD-main-amd64-test - Build #22809 (ccffe71ad4d9ac01f6bb4efa625ffcaf9fae739f) - Still Unstable

Build information:
Full change log:
Full build log:

Status explanation:
"Unstable" - some tests are suspected being broken by the following changes
"Still Unstable" - the failing test cases have not been fixed by these
                   following changes and this is a notification to note that
                   these changes have not been fully tested by the CI system

Change summaries:
(Those commits are likely but not certainly responsible)

5c2b216a1cd8de3aabfa9e76ca8f38774acd591e by markj:
mixer: Fix default_unit switching with mixers that have no devices

f7e2f98bffdafff65012fb02ad838c30b7e3502f by markj:
atomic: Remove cdefs.h includes from atomic_*.h

ccffe71ad4d9ac01f6bb4efa625ffcaf9fae739f by markj:
atomic.9: Remove the stated dependency on types.h

The failed test cases:

6 tests failed.
FAILED:  lib.libc.time.mktime_test.timegm_epoch

Error Message:
/usr/src/contrib/netbsd-tests/lib/libc/time/t_mktime.c:98: Expected errno 0, got 84, in t == (time_t)0


Error Message:
atf-check failed; see the output of the test for details

FAILED:  usr.sbin.etcupdate.preworld_test.main

Error Message:
Returned non-success exit status 1

FAILED:  sys.aio.aio_test.aio_socket_blocking_short_write

Error Message:
Test case body timed out

FAILED:  sys.aio.aio_test.aio_socket_blocking_short_write_vectored

Error Message:
Test case body timed out

FAILED:  sys.aio.aio_test.aio_socket_short_write_cancel

Error Message:
/usr/src/tests/sys/aio/aio_test.c:1396: aio_error(&iocb) == EINPROGRESS not met