FreeBSD-main-amd64-test - Build #22808 - Still Unstable

From: <>
Date: Tue, 17 Jan 2023 11:46:17 UTC
FreeBSD-main-amd64-test - Build #22808 (228c632ab3f6245df4a08d8692d49c8e12aacc27) - Still Unstable

Build information:
Full change log:
Full build log:

Status explanation:
"Unstable" - some tests are suspected being broken by the following changes
"Still Unstable" - the failing test cases have not been fixed by these
                   following changes and this is a notification to note that
                   these changes have not been fully tested by the CI system

Change summaries:
(Those commits are likely but not certainly responsible)

42904794b80489678e8a519ba453993232b11171 by melifaro:
rtsock: fix socket closure.

a8633361ab71fda3860f6b4ed1a602f9b52b36b8 by melifaro:
netlink: fix typo in netlink(4)

228c632ab3f6245df4a08d8692d49c8e12aacc27 by melifaro:
netlink: fix compatibility with older netlink applications.

The failed test cases:

6 tests failed.
FAILED:  lib.libc.time.mktime_test.timegm_epoch

Error Message:
/usr/src/contrib/netbsd-tests/lib/libc/time/t_mktime.c:98: Expected errno 0, got 84, in t == (time_t)0


Error Message:
atf-check failed; see the output of the test for details

FAILED:  usr.sbin.etcupdate.preworld_test.main

Error Message:
Returned non-success exit status 1

FAILED:  sys.aio.aio_test.aio_socket_blocking_short_write

Error Message:
Test case body timed out

FAILED:  sys.aio.aio_test.aio_socket_blocking_short_write_vectored

Error Message:
Test case body timed out

FAILED:  sys.aio.aio_test.aio_socket_short_write_cancel

Error Message:
/usr/src/tests/sys/aio/aio_test.c:1396: aio_error(&iocb) == EINPROGRESS not met