FreeBSD-main-amd64-test - Build #22743 - Still Unstable

From: <>
Date: Thu, 05 Jan 2023 00:12:58 UTC
FreeBSD-main-amd64-test - Build #22743 (11905a0b4e78b13959f89629568ffeb4786f912a) - Still Unstable

Build information:
Full change log:
Full build log:

Status explanation:
"Unstable" - some tests are suspected being broken by the following changes
"Still Unstable" - the failing test cases have not been fixed by these
                   following changes and this is a notification to note that
                   these changes have not been fully tested by the CI system

Change summaries:
(Those commits are likely but not certainly responsible)

0e2fdab227a1e02956271e5a15403d1408de1eed by karels:
growfs script: fix config-dependent errors

74abe47e3271594b8c6b60c9070806bf6ef8641c by jhibbits:
ifnet/DrvAPI: Implement if_setoutputfn() accessor

be4315dcbb8c54b9965815c5152c2c0bcb6e52e8 by jhibbits:
ifnet/DrvAPI: Move if_t typedef to a better place

11905a0b4e78b13959f89629568ffeb4786f912a by jhibbits:
ifnet: Expose if_t to userspace

The failed test cases:

3 tests failed.
FAILED:  sys.aio.aio_test.aio_socket_blocking_short_write

Error Message:
Test case body timed out

FAILED:  sys.aio.aio_test.aio_socket_blocking_short_write_vectored

Error Message:
Test case body timed out

FAILED:  sys.aio.aio_test.aio_socket_short_write_cancel

Error Message:
/usr/src/tests/sys/aio/aio_test.c:1396: aio_error(&iocb) == EINPROGRESS not met