FreeBSD-main-amd64-test - Build #22742 - Still Unstable

From: <>
Date: Wed, 04 Jan 2023 20:53:05 UTC
FreeBSD-main-amd64-test - Build #22742 (e5b9b5ee8c3a4f3bff348cd94e3555e6b69585f6) - Still Unstable

Build information:
Full change log:
Full build log:

Status explanation:
"Unstable" - some tests are suspected being broken by the following changes
"Still Unstable" - the failing test cases have not been fixed by these
                   following changes and this is a notification to note that
                   these changes have not been fully tested by the CI system

Change summaries:
(Those commits are likely but not certainly responsible)

8793196ca28f7b78f04ca479fe60b7d7af6b20e1 by andrew:
Check for more XHCI ACPI IDs

e5b9b5ee8c3a4f3bff348cd94e3555e6b69585f6 by andrew:
Add Windows Dev Kit 2023 support to if_ure

The failed test cases:

4 tests failed.
FAILED:  sys.fs.fusefs.mknod.main

Error Message:
Returned non-success exit status 1

FAILED:  sys.aio.aio_test.aio_socket_blocking_short_write

Error Message:
Test case body timed out

FAILED:  sys.aio.aio_test.aio_socket_blocking_short_write_vectored

Error Message:
Test case body timed out

FAILED:  sys.aio.aio_test.aio_socket_short_write_cancel

Error Message:
/usr/src/tests/sys/aio/aio_test.c:1396: aio_error(&iocb) == EINPROGRESS not met