FreeBSD-main-amd64-test - Build #22729 - Still Unstable

From: <>
Date: Sun, 01 Jan 2023 19:49:45 UTC
FreeBSD-main-amd64-test - Build #22729 (5affc86b804f0065e858cab4c5cbc80babc5e00f) - Still Unstable

Build information:
Full change log:
Full build log:

Status explanation:
"Unstable" - some tests are suspected being broken by the following changes
"Still Unstable" - the failing test cases have not been fixed by these
                   following changes and this is a notification to note that
                   these changes have not been fully tested by the CI system

Change summaries:
(Those commits are likely but not certainly responsible)

8161b823d77f9d89ffabd47444a83d693f74c515 by melifaro:
testing: add python test examples

14abc96e435b631e6c02ca92641bb1961b94bfd4 by ceri:
mpt.4: correct spelling error

5affc86b804f0065e858cab4c5cbc80babc5e00f by ceri:
mp[rs].4: correct spelling error, and expand "man page"

The failed test cases:

3 tests failed.
FAILED:  sys.aio.aio_test.aio_socket_blocking_short_write

Error Message:
Test case body timed out

FAILED:  sys.aio.aio_test.aio_socket_blocking_short_write_vectored

Error Message:
Test case body timed out

FAILED:  sys.aio.aio_test.aio_socket_short_write_cancel

Error Message:
/usr/src/tests/sys/aio/aio_test.c:1396: aio_error(&iocb) == EINPROGRESS not met