FreeBSD-main-amd64-test - Build #22728 - Still Unstable

From: <>
Date: Sun, 01 Jan 2023 17:35:59 UTC
FreeBSD-main-amd64-test - Build #22728 (bb60d265c9825d71cce84a42f66a435f05a6c5f7) - Still Unstable

Build information:
Full change log:
Full build log:

Status explanation:
"Unstable" - some tests are suspected being broken by the following changes
"Still Unstable" - the failing test cases have not been fixed by these
                   following changes and this is a notification to note that
                   these changes have not been fully tested by the CI system

Change summaries:
(Those commits are likely but not certainly responsible)

bb60d265c9825d71cce84a42f66a435f05a6c5f7 by melifaro:
testing: fix tests without cleanup in pytest.

The failed test cases:

4 tests failed.
FAILED:  sys.netinet6.ndp.ndp_del_gu_success

Error Message:
atf-check failed; see the output of the test for details

FAILED:  sys.aio.aio_test.aio_socket_blocking_short_write

Error Message:
Test case body timed out

FAILED:  sys.aio.aio_test.aio_socket_blocking_short_write_vectored

Error Message:
Test case body timed out

FAILED:  sys.aio.aio_test.aio_socket_short_write_cancel

Error Message:
/usr/src/tests/sys/aio/aio_test.c:1396: aio_error(&iocb) == EINPROGRESS not met