FreeBSD-main-amd64-test - Build #22724 - Still Unstable

From: <>
Date: Sun, 01 Jan 2023 07:23:17 UTC
FreeBSD-main-amd64-test - Build #22724 (73ed8e77a79398eb8e7b600a0b67f286e9e5cd53) - Still Unstable

Build information:
Full change log:
Full build log:

Status explanation:
"Unstable" - some tests are suspected being broken by the following changes
"Still Unstable" - the failing test cases have not been fixed by these
                   following changes and this is a notification to note that
                   these changes have not been fully tested by the CI system

Change summaries:
(Those commits are likely but not certainly responsible)

f6a891c2b422c077f3c8b764d0ebe4356f88fd23 by delphij:
Vendor import of xz 5.4.0 (trimmed)

The failed test cases:

4 tests failed.
FAILED:  sys.netpfil.common.dummynet.pf_queue

Error Message:
We failed prioritisation 1 times

FAILED:  sys.aio.aio_test.aio_socket_blocking_short_write

Error Message:
Test case body timed out

FAILED:  sys.aio.aio_test.aio_socket_blocking_short_write_vectored

Error Message:
Test case body timed out

FAILED:  sys.aio.aio_test.aio_socket_short_write_cancel

Error Message:
/usr/src/tests/sys/aio/aio_test.c:1396: aio_error(&iocb) == EINPROGRESS not met